{"text_format":"1","workbook":"xlsx","n_sheets":6,"sheets":["Consignes","Collectes","Tarifs","Suivi","SuiviPluriAnnuel","Macros"],"not_rendered":{"charts":0,"images":0,"macros":1,"external_links":0,"defined_names":8,"comments":0,"pivot_tables":0},"unopened":[],"bounds":{"document_bytes":16777216,"sheet_cells":100000,"rows_first":2000,"rows_last":500,"rows_between":2000,"halvings":0,"cell_chars":16384,"cell_head_chars":4096},"cells_cut":0,"cells_raw":0,"read":"whole","date_system":"1900"}

{"sheet":"Consignes","index":0,"n_rows":40,"n_cols":2,"rows_kept":40,"cut":false,"hidden":false,"merged":[]}
[null,"DOSSIER 4 AU CHOIX – SUIVI DES COLLECTES."]
[]
[null,"L’entreprise eRecycle effectue les collectes auprès de ses clients régulièrement. Afin d’améliorer ces collectes et inciter ses clients à mieux gérer leurs recyclages, monsieur MARQUET décide de gérer un suivi grâce à un tableur. Il vous soumet ses besoins :"]
[null,"-        Pour chaque client l’entreprise disposera d’un fichier sous tableur dont un exemple est donné dans le (document 7) ;"]
[null,"-        Ce fichier permettra de :"]
[null,"·       Saisir les informations relatives aux différentes collectes et traitements (feuille « Collectes »)."]
[null,"Après chaque collecte chez le client, les matériels sont pesés puis traités et les informations correspondant au recyclage et/ou au réemploi sont saisies dans la feuille « Collectes »."]
[null,"·       Connaître les informations tarifaires concernant les abonnements et les matières prélevées (feuille « Tarifs »)."]
[null,"Pour chaque type de matériel collecté, eRecycle facture un prix de collecte au kg. Cependant, lorsque le matériel peut être recyclé ou réemployé, elle applique une déduction."]
[null,"·       Suivre le recyclage (feuille « Suivi »)."]
[null,"La feuille « Suivi » est automatiquement alimentée dès les premières saisies de collecte. Le coût global annuel (coût de l’abonnement et des collectes) est diminué des éventuels gains générés par le recyclage et le réemploi."]
[null,"Afin d’accompagner ses clients dans leurs opérations de tri, l’entreprise comparera leurs statistiques de recyclage et de réemploi par type de matériel à un objectif. Deux indicateurs de performance synthétisent ces résultats (Performance Recyclage et Performance Réemploi). Ils s’obtiennent en rapportant le nombre de cas « OK », au nombre de cas où l’objectif a été mesuré."]
[null,"·       Données de synthèse du recyclage des années antérieures (feuille « SuiviPluriAnnuel »)."]
[null,"Cette feuille permet de conserver les données de synthèse des abonnements antérieurs. "]
[null,"Mission 1 : élaboration d’un outil sous tableur."]
[null,"Pour réaliser cette mission, vous devez :"]
[null,"1.      Proposer une solution de sécurisation de la saisie du type d’abonnement souscrit par le client (cellule B3) afin qu’elle soit conforme au type d’abonnement possible."]
[null,"2.      Compléter les formules des cellules de l’annexe A (à rendre avec la copie)."]
["C3"]
["D3"]
["F3"]
["D11"]
["C5"]
[]
[null,"La feuille « SuiviPluriAnnuel » est alimentée lors du clic sur le bouton « Suivi pluriannuel » figurant sur la feuille « Suivi ». La macro attachée à ce bouton est partiellement décrite ci-dessous."]
[null,"3.     Décrire les actions réalisées par la macro."]
[null,"4.     Compléter la macro afin d’obtenir une feuille complète"]
[]
[]
[null,"Sub suiviPluri()"]
[null,"    Sheets(\"SuiviPluriannuel\").Select"]
[null,"    Rows(\"3:3\").Select"]
[null,"    Selection.Insert Shift:=xlDown, CopyOrigin:=xlFormatFromLeftOrAbove"]
[null,"    Sheets(\"Suivi\").Select"]
[null,"    Range(\"A3:I3\").Select"]
[null,"    Selection.Copy"]
[null,"    Sheets(\"SuiviPluriannuel\").Select"]
[null,"    Selection.PasteSpecial Paste:=xlPasteValuesAndNumberFormats"]
[null,"     ….."]
[null,"End Sub"]

{"sheet":"Collectes","index":1,"n_rows":29,"n_cols":7,"rows_kept":29,"cut":false,"hidden":false,"merged":[]}
[]
[null,"Collectes"]
[null,"num Collecte","Date","idTypMatériel","Kg collectés","Kg Recyclés","Kg réemployés"]
[null,1,"2019-01-16",1,150,122,0]
[null,null,null,2,6,4,2]
[null,2,"2019-02-18",1,135,101,0]
[null,null,null,3,35,29,6]
[null,null,null,7,40,20,0]
[null,3,"2019-03-14",1,180,138,0]
[null,null,null,2,7,2,2]
[null,null,null,4,8,4,0]
[null,4,"2019-04-13",1,234,172,0]
[null,5,"2019-05-11",5,3,1,1]
[null,null,null,7,43,6,0]
[null,6,"2019-06-13",1,276,203,0]
[null,null,null,2,6,2,2]
[null,null,null,6,2,1,0]
[null,7,"2019-07-16",1,200,149,0]
[null,null,null,2,5,2,1]
[null,8,"2019-08-18",3,23,19,4]
[null,9,"2019-09-14",1,100,89,0]
[null,null,null,2,7,2,2]
[null,10,"2019-10-14",1,230,179,0]
[null,null,null,2,6,4,2]
[null,11,"2019-11-08",1,122,92,0]
[null,null,null,3,30,25,5]
[null,null,null,7,45,22,0]
[null,12,"2019-12-14",1,180,130,0]
[null,null,null,2,7,2,2]

{"sheet":"Tarifs","index":2,"n_rows":21,"n_cols":9,"rows_kept":21,"cut":false,"hidden":false,"merged":[]}
[null,"Tarifs des matériaux prélevés"]
[null,"Identifiant","MatérieIs","Contient des données","Prix du Kg collecté","Prix du Kg Recyclé","Prix du Kilo réemployé","% moyen de recvclage","% moyen de réemploi"]
[null,1,"Papiers et cartons","O",0.5,0.2,0,0.75,0]
[null,2,"Cartouches d'encres","N",2,0.5,1,0.65,0.25]
[null,3,"Matériels informatiques","O",1,0.2,0.25,0.6,0.1]
[null,4,"Autres supports de données","O",5,1,1.5,0.35,0.15]
[null,5,"Piles et accus","N",5,1.25,1.5,0.5,0.05]
[null,6,"Lampes, néons et ampoules","N",5,0.25,2,0.15,0.05]
[null,7,"Autres petits déchets recyclables de bureau","N",2,0.15,0,0.4,0]
[null,8,"Mobilier de bureau","N",1,0.3,0.5,0.2,0.15]
[]
[]
[]
[]
[]
[null,"Abonnements"]
[null,"Type abonnement","Formule","Tarif annuel"]
[null,1,"Recycle Papier",50]
[null,2,"Recycle Cartouche",60]
[null,3,"Recycle Data",300]
[null,4,"Total Recycle",500]

{"sheet":"Suivi","index":3,"n_rows":31,"n_cols":9,"rows_kept":31,"cut":false,"hidden":false,"merged":[[26,1,26,2],[27,1,27,2],[28,1,28,2],[29,1,29,2],[30,1,30,2],[21,3,21,5],[8,5,8,6],[8,7,8,8],[22,1,22,2],[23,1,23,2],[24,1,24,2],[25,1,25,2],[21,6,21,8],[14,1,14,2],[15,1,15,2],[16,1,16,2],[17,1,17,2],[18,1,18,2],[8,3,8,4],[9,1,9,2],[10,1,10,2],[11,1,11,2],[12,1,12,2],[13,1,13,2]]}
["Client","Salmin Immobilier"]
["Année","Type abonnement","Formule","Nombre de collectes","Poids","Coût global annuel du tri","Gain annuel du tri","Total annuel à régler","Économie réalisée grâce au tri"]
[2018,4,{"$f":"IF(ISBLANK(TypA),\"\",IFERROR(VLOOKUP(TypA,TabAbonnements,2,0),\"erreur !\"))","v":"Total Recycle"},{"$f":"COUNT(numCollecte)","v":12},"173.33",{"$f":"IF(ISBLANK(TypA),\"\",IFERROR(\nVLOOKUP(TypA,TabAbonnements,3,0)+E19,\"erreur !\"))","v":1900.5},329.55,1570.95,0.17]
[]
[null,"Performance Recyclage",{"$f":"IFERROR(COUNTIF(F24:F31,\"OK\")/COUNT(D24:D31),\"\")","v":0.5714285714285714},null,"Performance Réemploi",0.6]
[]
[]
[]
[null,null,null,"Collecte",null,"Recyclage",null,"Réemploi"]
["Code","Matériels",null,"Kilos collectés","Coût collecte","Kilos recyclés","Gain recyclage","Kilos réemployés","Gain réemploi"]
[1,"Papiers et cartons",null,{"$f":"IF(ISBLANK(TypA),\"\",SUMIF(idTypeMatériel,A11,kgCollectés))","v":1807},903.5,1375,275,0,0]
[2,"Cartouches d'encres",null,{"$f":"IF(ISBLANK(TypA),\"\",SUMIF(idTypeMatériel,A12,kgCollectés))","v":44},88,18,9,13,13]
[3,"Matériels informatiques",null,{"$f":"IF(ISBLANK(TypA),\"\",SUMIF(idTypeMatériel,A13,kgCollectés))","v":88},88,73,4.5999999999999996,15,3.75]
[4,"Autres supports de données",null,{"$f":"IF(ISBLANK(TypA),\"\",SUMIF(idTypeMatériel,A14,kgCollectés))","v":8},40,4,4,0,0]
[5,"Piles et accus",null,{"$f":"IF(ISBLANK(TypA),\"\",SUMIF(idTypeMatériel,A15,kgCollectés))","v":3},15,1,1.25,1,1.5]
[6,"Lampes. néons et ampoules",null,{"$f":"IF(ISBLANK(TypA),\"\",SUMIF(idTypeMatériel,A16,kgCollectés))","v":2},10,1,0.25,0,0]
[7,"Autres petits déchets recyclables de burea",null,{"$f":"IF(ISBLANK(TypA),\"\",SUMIF(idTypeMatériel,A17,kgCollectés))","v":128},256,48,7.2,0,0]
[8,"Mobilier de bureau",null,{"$f":"IF(ISBLANK(TypA),\"\",SUMIF(idTypeMatériel,A18,kgCollectés))","v":0},0,0,0,0,0]
[null,"Total",null,2080,1400.5,1520,311.3,28,18.25]
[]
[]
[null,null,null,"Recyclage",null,null,"Réemploi"]
["Code","Matériels",null,"%","Obiectif","Niveau de votre entreprise","%","Obiectif","Niveau de votre enreprise"]
[1,"Papiers et cartons",null,0.76,0.75,"OK",0,0]
[2,"Cartouches d'encres",null,0.41,0.65,null,0.3,0.25,"OK"]
[3,"Matériels informatiques",null,0.83,0.6,"OK",0.17,0.1,"OK"]
[4,"Autres supports de données",null,0.5,0.35,"OK",0,0.15]
[5,"Piles et accus",null,0.33,0.5,null,0.33,0.05,"OK"]
[6,"Lampes, néons et ampoules",null,0.5,0.15,"OK",0,0.05]
[7,"Autres petits déchets recyclables de burea",null,0.38,0.4,null,0,0]
[8,"Mobilier de bureau"]

{"sheet":"SuiviPluriAnnuel","index":4,"n_rows":4,"n_cols":11,"rows_kept":4,"cut":false,"hidden":false,"merged":[]}
["Client","Salmin Immobilier"]
["Année","Type abonnement","Formule","Nombre de collectes","Poids moyen","Coût global annuel du tri","Gain global annuel du tri","Total annuel à régler","réalisée grâce au tri","Performance Recyclage","Performance Réemploi"]
[2018,4,"Total Recycle",10,160.56,1200.3399999999999,223.5,976.84,0.19,0.7,0.4]
[2017,4,"Total Recycle",6,154.32,854.25,55.26,798.99,0.06,0.67,0.25]

{"sheet":"Macros","index":5,"n_rows":37,"n_cols":2,"rows_kept":37,"cut":false,"hidden":false,"merged":[]}
["Sub suiviPluri()"]
["    Sheets(\"SuiviPluriannuel\").Select","Sélection de la feuille « SuiviPluriannuel » "]
["    Rows(\"3:3\").Select","Puis sélection de la ligne 3"]
["    Selection.Insert Shift:=xlDown, CopyOrigin:=xlFormatFromLeftOrAbove","Insertion d’une ligne "]
["    Sheets(\"Suivi\").Select"]
["    Range(\"A3:I3\").Select","Sélection de la feuille « Suivi »"]
["    Selection.Copy","Sélection de la plage de cellules A3:I3"]
["    Sheets(\"SuiviPluriannuel\").Select","Copie de la plage sélectionnée"]
["    Range(\"A3\").Select","Sélection de la feuille « SuiviPluriAnnuel »"]
["    Selection.PasteSpecial Paste:=xlPasteValuesAndNumberFormats","Sélection de la cellule A3"]
[null,"Collage spécial de la sélection précédente"]
[]
[]
["Sub suiviPluri()"]
["‘partie existante "]
["Sheets(\"SuiviPluriannuel\").Select"]
["Rows(\"3:3\").Select"]
["Selection.Insert Shift:=xlDown, CopyOrigin:=xlFormatFromLeftOrAbove"]
["Sheets(\"Suivi\").Select"]
["Range(\"A3:I3\").Select"]
["Selection.Copy"]
["Sheets(\"SuiviPluriannuel\").Select"]
["Selection.PasteSpecial Paste:=xlPasteValuesAndNumberFormats"]
["‘partie à ajouter "]
["Sheets(\"Suivi\").Select"]
[" Range(\"C5\").Select"]
[" Selection.Copy"]
[" Sheets(\"SuiviPluriannuel\").Select"]
[" Range(\"J3\").Select"]
[" Selection.PasteSpecial Paste:=xlPasteValuesAndNumberFormats"]
[" Sheets(\"Suivi\").Select"]
[" Range(\"F5\").Select"]
[" Selection.Copy"]
[" Sheets(\"SuiviPluriannuel\").Select"]
[" Range(\"K3\").Select"]
[" Selection.PasteSpecial Paste:=xlPasteValuesAndNumberFormats"]
["End Sub"]